{"text_format":"1","workbook":"xlsx","n_sheets":6,"sheets":["New Topics","Start","Import","Sheet2","Sheet3","Index"],"not_rendered":{"charts":0,"images":145,"macros":1,"external_links":0,"defined_names":0,"comments":2,"pivot_tables":0},"unopened":[],"bounds":{"document_bytes":16777216,"sheet_cells":100000,"rows_first":2000,"rows_last":500,"rows_between":2000,"halvings":0,"cell_chars":16384,"cell_head_chars":4096},"cells_cut":0,"cells_raw":0,"read":"whole","date_system":"1900"}

{"sheet":"New Topics","index":0,"n_rows":0,"n_cols":0,"rows_kept":0,"cut":false,"hidden":true,"merged":[]}

{"sheet":"Start","index":1,"n_rows":29,"n_cols":16,"rows_kept":29,"cut":false,"hidden":false,"merged":[]}
[{"$f":"CELL(\"Address\",A1)","v":"$A$1"},2,null,{"$f":"INDIRECT(A3)","v":45982.477905092594},"Entry?",{"$f":"INDIRECT(A4)","v":"Dean62"},"Entry?",null,"Update in progress",null,"New index"]
[null,null,null,null,{"$f":"D1>0","v":true},null,{"$f":"F1=0","v":false},null,{"$f":"$D$1=I1","v":false},null,{"$f":"$D$1=K1","v":false},{"$f":"OR(I2,K2)","v":false},{"$f":"OR($D$1=0,K2)","v":false}]
["Import!I1",null,null,null,null,"There is an exising index, last updated ",null,"(Find the last entry on or before the above date. All entries prior to this are new. Note If that is not page 1, append the new entries on subsequent pages.)"]
["Import!A2",null,null,null,null,"To create a new Index:",null,"Paste entries from subsequent pages below these to make one continuous list."]
[null,null,null,null,null,{"$f":"\"Go to step \" & IF(G2,2,4)","v":"Go to step 4"},null,"created since the index was last updated.","from the selected forum.",null,null,null,null,null,null,"\" from the selected forum.\""]
["To create a new Index or update an existing one:"]
[]
[null,null,null,null,null,null,{"$f":"IF(L2,I1,IF(E2,F3,F4))","v":"There is an exising index, last updated "},{"$f":"IF(L2,F5,IF(E2,D1,\"\"))","v":"2025-11-21T11:28:11"}]
[]
[null,1,{"$f":"\"Add topics \" & IF(E2,H5,I5)","v":"Add topics created since the index was last updated."}]
[]
[null,2,"Open the","Historical","forum on SOS and copy the rows containing new topic titles."]
[null,null,{"$f":"IF(M2,\"\",H3)","v":"(Find the last entry on or before the above date. All entries prior to this are new. Note If that is not page 1, append the new entries on subsequent pages.)"}]
[]
[null,3,"Paste these into cell A1 on the 'New Topics' sheet and return to this sheet."]
[null,null,{"$f":"IF(M2,H4,\"\")","v":""}]
[]
[null,4,"Click [Extract data] to copy the names and links from the' Import' sheet."]
[]
[null,5,"On sheet 3, enter any missing ship's names in column 'A' Omit 'HMS', 'USS' etc."]
{"$rows_left_out":10}
{"sheet":"Import","index":2,"n_rows":685,"n_cols":9,"rows_kept":685,"cut":false,"hidden":false,"merged":[]}
["My 1/72 scale aircraft","https://shipsofscale.com/sosforums/threads/my-1-72-scale-aircraft.17224/",null,null,null,null,null,null,"2025-11-21T11:28:11"]
["Dean62"]
["Jun 26, 2025"]
["15 16 17 18 19 20 21 22 23 24"]
["Replies"]
[464]
["Views"]
[26704]
["Yesterday at 10:19 PM"]
["Corsair"]
["Triumph Tr6, 3d printed large scale","https://shipsofscale.com/sosforums/threads/triumph-tr6-3d-printed-large-scale.17843/"]
["François"]
["Oct 5, 2025"]
["2 3"]
["Replies"]
[41]
["Views"]
[1315]
["Yesterday at 8:48 PM"]
["François"]
{"$rows_left_out":666}
{"sheet":"Sheet2","index":3,"n_rows":83,"n_cols":6,"rows_kept":83,"cut":false,"hidden":false,"merged":[]}
["$B$12"]
[]
[]
[83]
[]
[]
[]
[]
[]
[]
["Model type & name","Title","Topic","Latest Post","Starter","Profile"]
[{"$error":"#N/A"},"My 1/72 scale aircraft","https://shipsofscale.com/sosforums/threads/my-1-72-scale-aircraft.17224/","https://shipsofscale.com/sosforums/threads/my-1-72-scale-aircraft.17224/page-24","Dean62",24]
[{"$error":"#N/A"},"Triumph Tr6, 3d printed large scale","https://shipsofscale.com/sosforums/threads/triumph-tr6-3d-printed-large-scale.17843/","https://shipsofscale.com/sosforums/threads/triumph-tr6-3d-printed-large-scale.17843/page-3","François",3]
[{"$error":"#N/A"},"Airfix SEPECAT JAGUAR GR1 1/48 by Smithy","https://shipsofscale.com/sosforums/threads/airfix-sepecat-jaguar-gr1-1-48-by-smithy.18048/","https://shipsofscale.com/sosforums/threads/airfix-sepecat-jaguar-gr1-1-48-by-smithy.18048/page-3","Smithy",3]
[{"$error":"#N/A"},"Model of classic RuneScape king black dragon - piñata","https://shipsofscale.com/sosforums/threads/model-of-classic-runescape-king-black-dragon-pi%C3%B1ata.17642/","https://shipsofscale.com/sosforums/threads/model-of-classic-runescape-king-black-dragon-pi%C3%B1ata.17642/page-6","DerezzedDragon",6]
["Plane - NHI H-3","NHI Kolibri N-3, scale 1:48, scratch build","https://shipsofscale.com/sosforums/threads/nhi-kolibri-n-3-scale-1-48-scratch-build.15209/","https://shipsofscale.com/sosforums/threads/nhi-kolibri-n-3-scale-1-48-scratch-build.15209/page-19","RDN1954",19]
[{"$error":"#N/A"},"My plane builds since 2008","https://shipsofscale.com/sosforums/threads/my-plane-builds-since-2008.17801/","https://shipsofscale.com/sosforums/threads/nhi-kolibri-n-3-scale-1-48-scratch-build.15209/page-19","kg4kpg"]
["Plane - Wright Flier","Wright Brothers \"Flyer\" 1903","https://shipsofscale.com/sosforums/threads/wright-brothers-flyer-1903.15124/","https://shipsofscale.com/sosforums/threads/wright-brothers-flyer-1903.15124/page-15","Daniel20",15]
[{"$error":"#N/A"},"Revell 68 Corvette 1/25 scale","https://shipsofscale.com/sosforums/threads/revell-68-corvette-1-25-scale.17747/","https://shipsofscale.com/sosforums/threads/revell-68-corvette-1-25-scale.17747/page-2","Dean62",2]
["Car - Hydra coupe","Marvel's Hydra Coupe 1/12 scale full scratch build","https://shipsofscale.com/sosforums/threads/marvels-hydra-coupe-1-12-scale-full-scratch-build.14926/","https://shipsofscale.com/sosforums/threads/marvels-hydra-coupe-1-12-scale-full-scratch-build.14926/page-17","François",17]
{"$rows_left_out":64}
{"sheet":"Sheet3","index":4,"n_rows":88,"n_cols":7,"rows_kept":88,"cut":false,"hidden":false,"merged":[]}
[{"$f":"\"A\"&ROW(A16)+1","v":"A17"},3]
[{"$f":"CELL(\"Address\",G5)","v":"$G$5"}]
[{"$f":"ROW(B16)+1","v":17}]
[88]
[1,null,null,null,null,null,{"$f":"A5","v":1}]
[{"$f":"\"$A$\"&$A$3&\":$G$\"&$A$4","v":"$A$17:$G$88"}]
[{"$f":"\"$B$\"&$A$3&\":$G$\"&$A$4","v":"$B$17:$G$88"},{"$f":"\"=VLOOKUP(B12,Sheet3!\"&A7&\",6,false)\"","v":"=VLOOKUP(B12,Sheet3!$B$17:$G$88,6,false)"}]
[{"$f":"\"$B$\"&$A$3&\":$C$\"&$A$4","v":"$B$17:$C$88"}]
[1557]
[{"$f":"\"$A1\"&\":$A\"&A9","v":"$A1:$A1557"}]
[]
[]
[]
[]
["Subject:"]
[{"$f":"Index!A20","v":"Model type & name"},"Title","Topic","Latest","By","Page",{"$f":"A16","v":"Model type & name"}]
["Ca r - Corvette","Chevrolet Corvette 2022 Stingray Coupe","https://shipsofscale.com/sosforums/threads/chevrolet-corvette-2022-stingray-coupe.17545/","https://shipsofscale.com/sosforums/threads/chevrolet-corvette-2022-stingray-coupe.17545/page-2","Donnie",2,{"$f":"A17","v":"Ca r - Corvette"}]
["Car -  Ryan Blaney","Another NASCAR","https://shipsofscale.com/sosforums/threads/another-nascar.17802/","https://shipsofscale.com/sosforums/threads/marvels-hydra-coupe-1-12-scale-full-scratch-build.14926/page-17","Donnie",null,{"$f":"A18","v":"Car -  Ryan Blaney"}]
["Car - Alpha Romeo","1/12 scale Alfa Romeo 8c 2300 roadster build log [COMPLETED BUILD]","https://shipsofscale.com/sosforums/threads/1-12-scale-alfa-romeo-8c-2300-roadster-build-log-completed-build.10977/","https://shipsofscale.com/sosforums/threads/1-12-scale-alfa-romeo-8c-2300-roadster-build-log-completed-build.10977/page-10","François",10,{"$f":"A19","v":"Car - Alpha Romeo"}]
["Car - Alpha Romeo","Alpha Romeo 8C 2300 Monza - Italeri [COMPLETED BUILD]","https://shipsofscale.com/sosforums/threads/alpha-romeo-8c-2300-monza-italeri-completed-build.10453/","https://shipsofscale.com/sosforums/threads/alpha-romeo-8c-2300-monza-italeri-completed-build.10453/page-4","Donnie",4,{"$f":"A20","v":"Car - Alpha Romeo"}]
{"$rows_left_out":69}
{"sheet":"Index","index":5,"n_rows":157,"n_cols":20,"rows_kept":157,"cut":false,"hidden":false,"merged":[]}
[{"$f":"\"A\" & ROW(A21)+1","v":"A22"},6,{"$f":"TEXT(NOW(),\"dd/mm/yy\")","v":"22/11/25"},"<head><meta charset=\"utf-8\" /></head>",null,null,"Edit these entries to change the formatting ---->","<td width=\"","<span style=\"text-decoration: underline;\">","<strong>","<em>","<tr>","<u>","<td>","<a href=\"","\">","<table width=\"","<tbody>","<p>","<div style=\"text-align: center;\">"]
[{"$f":"CELL(\"address\",A20)","v":"$A$20"},null,null,null,null,null,null,"%\">","</span>","</strong>","</em>","</tr>","</u>","</td>","</a>",null,"%\" border=\"0\">","</tbody>","&#160;","<div style=\"text-align: left;\">"]
[{"$f":"ROW(A21)+1","v":22},"Start Row",null,null,null,null,"See range stating at V1 for previous values",null,"<hr />","#TOP\">Back to Top","<a name=\"",null,null,null,null,null,"</table>",null,"</p>","</div>"]
[156,"End Row",null,null,null,null,{"$f":"$D$1& $B$8&$C$8","v":"<head><meta charset=\"utf-8\" /></head><div style=\"text-align: center;\"><strong>This is a list of all the build logs in the Historical forum - 22/11/25</strong></div><div style=\"text-align: center;\"></div><div style=\"text-align: center;\">The logs are in alphabetical order of the ships name (Ignoring any prefix, e.g. HMS, USS etc.)</div><div style=\"text-align: center;\">Select a letter from the list below to jump within the index.</div><hr /><div style=\"text-align: center;\"></div><div style=\"text-align: center;\">A&#160;&#160;B&#160;&#160;<a href=\"#C\">C</a>&#160;&#160;D&#160;&#160;E&#160;&#160;F&#160;&#160;<a href=\"#G\">G</a>&#160;&#160;H&#160;&#160;I&#160;&#160;J&#160;&#160;K&#160;&#160;<a href=\"#L\">L</a>&#160;&#160;<a href=\"#M\">M</a>&#160;&#160;N&#160;&#160;O&#160;&#160;<a href=\"#P\">P</a>&#160;&#160;Q&#160;&#160;R&#160;&#160;<a href=\"#S\">S</a>&#160;&#160;<a href=\"#T\">T</a>&#160;&#160;U&#160;&#160;V&#160;&#160;W&#160;&#160;X&#160;&#160;Y&#160;&#160;Z&#160;&#160;</div>"},"",null,null,null,null,null,null,null,null,null,null,{"$f":"S1&S2&S3","v":"<p>&#160;</p>"}]
[{"$f":"CELL(\"address\",$G$5)&\":\"&CELL(\"address\",$M$5)","v":"$G$5:$M$5"},{"$f":"B14&Start!D12& \" forum\"","v":"This is a list of all the build logs in the Historical forum"},null,null,null,null,{"$f":"H5&I5&J5&L5","v":"<tr><td><strong>$G$5:$M$5</strong></td><td></td><td><a href=\"\">This is a list of all the build logs in the Historical forum</a></td><td></td></tr>"},{"$f":"$L$1&$N$1&$J$1&A5&$J$2&$N$2","v":"<tr><td><strong>$G$5:$M$5</strong></td>"},{"$f":"$N$1&E5&$N$2","v":"<td></td>"},{"$f":"$N$1&$O$1&C5&$P$1&B5&$O$2&$N$2","v":"<td><a href=\"\">This is a list of all the build logs in the Historical forum</a></td>"},{"$f":"F5","v":0},{"$f":"$N$1&IF(K5>0,$O$1&D5&$P$1&\"Page \"&K5&$O$2,\"\")&$N$2&$L$2","v":"<td></td></tr>"},""]
[{"$f":"CELL(\"address\",G4)","v":"$G$4"},null,null,null,null,null,"heading 1","heading 2","heading 3","heading 4"]
[{"$f":"CELL(\"address\",G21)","v":"$G$21"},"Opening text","A-Z bar","Table setup",null,"Headings: ",{"$f":"$H$1&M16&$H$2&$I$1&$J$1&$A$20&$J$2&$I$2&$N$2","v":"<td width=\"20%\"><span style=\"text-decoration: underline;\"><strong>Model type & name</strong></span></td>"},{"$f":"$H$1&N16&$H$2&$I$1&$J$1&$E$20&$J$2&$I$2&$N$2","v":"<td width=\"12%\"><span style=\"text-decoration: underline;\"><strong>By</strong></span></td>"},{"$f":"$H$1&O16&$H$2&$I$1&$J$1&$B$20&$J$2&$I$2&$N$2","v":"<td width=\"62%\"><span style=\"text-decoration: underline;\"><strong>Topic</strong></span></td>"},{"$f":"$H$1&P16&$H$2&$I$1&$J$1&$D$20&$J$2&$I$2&$N$2","v":"<td width=\"6%\"><span style=\"text-decoration: underline;\"><strong>Latest</strong></span></td>"}]
[{"$f":"CELL(\"address\",G10)","v":"$G$10"},{"$f":"$T$1&$J$1&IF(B5<>\"\",B5&\" - \"&$C$1,\"\")&$J$2&$T$3     &$T$1&IF(C14<>\"\",C14,\"\")&$T$3    &$T$1&IF(D14<>\"\",D14,\"\")&$T$3   &$T$1&IF(E14<>\"\",E14,\"\")&$T$3 &$I$3& T1&T3","v":"<div style=\"text-align: center;\"><strong>This is a list of all the build logs in the Historical forum - 22/11/25</strong></div><div style=\"text-align: center;\"></div><div style=\"text-align: center;\">The logs are in alphabetical order of the ships name (Ignoring any prefix, e.g. HMS, USS etc.)</div><div style=\"text-align: center;\">Select a letter from the list below to jump within the index.</div><hr /><div style=\"text-align: center;\"></div>"},"<div style=\"text-align: center;\">A&#160;&#160;B&#160;&#160;<a href=\"#C\">C</a>&#160;&#160;D&#160;&#160;E&#160;&#160;F&#160;&#160;<a href=\"#G\">G</a>&#160;&#160;H&#160;&#160;I&#160;&#160;J&#160;&#160;K&#160;&#160;<a href=\"#L\">L</a>&#160;&#160;<a href=\"#M\">M</a>&#160;&#160;N&#160;&#160;O&#160;&#160;<a href=\"#P\">P</a>&#160;&#160;Q&#160;&#160;R&#160;&#160;<a href=\"#S\">S</a>&#160;&#160;<a href=\"#T\">T</a>&#160;&#160;U&#160;&#160;V&#160;&#160;W&#160;&#160;X&#160;&#160;Y&#160;&#160;Z&#160;&#160;</div>",{"$f":"$L$10&$R$1&$L$1&$G$7&$H$7&$I$7&$J$7","v":"<table width=\"100%\" border=\"0\"><tbody><tr><td width=\"20%\"><span style=\"text-decoration: underline;\"><strong>Model type & name</strong></span></td><td width=\"12%\"><span style=\"text-decoration: underline;\"><strong>By</strong></span></td><td width=\"62%\"><span style=\"text-decoration: underline;\"><strong>Topic</strong></span></td><td width=\"6%\"><span style=\"text-decoration: underline;\"><strong>Latest</strong></span></td>"},"First row",null,{"$f":"IF(INDIRECT($A$1)<>\" \",$L$1&$N$1&\"&#160;\"&$N$2&$L$2,\"\")","v":""}]
[null,null,null,null,null,"Divide table: ",{"$f":"$I$3&$S$1&O$1 &$J$3&$O$2&$S$3","v":"<hr /><p><a href=\"#TOP\">Back to Top</a></p>"},{"$f":"$T$2&$I$3&$K$3","v":"<div style=\"text-align: left;\"><hr /><a name=\""},{"$f":"$P$1&$O$2&$J$1","v":"\"></a><strong>"},{"$f":"$J$2&T3","v":"</strong></div>"},null,"<p><u><a name=\"A\"></a><strong>A</strong></u></p><table width=\"100%\" border=\"0\"><tbody><tr><td width=\"40%\"><span style=\"text-decoration: underline;\"><strong>Subject</strong></span></td><td width=\"40%\"><span style=\"text-decoration: underline;\"><strong>Document</strong></span></td><td width=\"20%\"><span style=\"text-decoration: underline;\"><strong>Page</strong></span></td></u></tr>",""]
[{"$f":"A20","v":"Model type & name"},{"$f":"G9&IF(B18<>\"\",$I$3&$S$1&B18&$S$3&$S$1&IF(C18<>\"\",C18,$S$2)&$S$3&IF(D18<>\"\",$S$1&D18&$S$3,IF(E18<>\"\",$S$4,IF(C18<>\"\",$S$4,\"\")))&IF(E18<>\"\",$S$1&E18&$S$3&$S$4,IF(D18<>\"\",$S$4,\"\")),\"\")","v":"<hr /><p><a href=\"#TOP\">Back to Top</a></p><hr /><p>If you have any comments or require any corrections or amendments to this index, please post them <a href=\"http://www.modelshipbuilder.com/e107_plugins/forum/forum_viewtopic.php?9057\">here</a></p><p>&#160;</p>"},"",null,null,null,{"$f":"$R$2&$Q$3&IF($B$10<>\"\",$S$4&$B$10,\"\")","v":"</tbody></table><p>&#160;</p><hr /><p><a href=\"#TOP\">Back to Top</a></p><hr /><p>If you have any comments or require any corrections or amendments to this index, please post them <a href=\"http://www.modelshipbuilder.com/e107_plugins/forum/forum_viewtopic.php?9057\">here</a></p><p>&#160;</p>"},"",null,null,null,{"$f":"Q1&M13&Q2","v":"<table width=\"100%\" border=\"0\">"}]
[]
[null,"Opening Text"]
[null,"Line 1","Line 2","Line 3","Line 4",null,"Edit this entry to change the overall table width",null,null,null,null,null,100]
[null,"This is a list of all the build logs in the ",null,"The logs are in alphabetical order of the ships name (Ignoring any prefix, e.g. HMS, USS etc.)","Select a letter from the list below to jump within the index."]
[null,null,null,null,null,null,null,null,null,null,null,null,"Col. 1","Col. 2","Col. 3","Col. 4"]
[null,"Closing Text",null,null,null,null,"Edit these entries to change the column widths",null,null,null,null,null,20,12,62,{"$f":"MAX(100-SUM(M16:O16),0)","v":6}]
[null,"Line 1","Line 2","Line 3","Line 4"]
[null,"If you have any comments or require any corrections or amendments to this index, please post them <a href=\"http://www.modelshipbuilder.com/e107_plugins/forum/forum_viewtopic.php?9057\">here</a>"]
[null,null,null,null,null,null,null,null,null,"topic +"]
["Model type & name","Topic","Topic Link","Latest","By","Page","HTML Index Text","ship","by","link","Page","Page + link"]
{"$rows_left_out":137}