{"text_format":"1","workbook":"xlsx","n_sheets":6,"sheets":["New Topics","Start","Import","Sheet2","Sheet3","Index"],"not_rendered":{"charts":0,"images":50,"macros":1,"external_links":0,"defined_names":0,"comments":2,"pivot_tables":0},"unopened":[],"bounds":{"document_bytes":16777216,"sheet_cells":100000,"rows_first":2000,"rows_last":500,"rows_between":2000,"halvings":0,"cell_chars":16384,"cell_head_chars":4096},"cells_cut":0,"cells_raw":0,"read":"whole","date_system":"1900"}

{"sheet":"New Topics","index":0,"n_rows":0,"n_cols":0,"rows_kept":0,"cut":false,"hidden":true,"merged":[]}

{"sheet":"Start","index":1,"n_rows":29,"n_cols":13,"rows_kept":29,"cut":false,"hidden":false,"merged":[]}
[{"$f":"CELL(\"Address\",A1)","v":"$A$1"},2,null,{"$f":"INDIRECT(A3)","v":45968.659479166665},"Entry?",{"$f":"INDIRECT(A4)","v":"Iterum"},"Entry?",null,"Update in progress",null,"New index"]
[null,null,null,null,{"$f":"D1>0","v":true},null,{"$f":"F1=0","v":false},null,{"$f":"$D$1=I1","v":false},null,{"$f":"$D$1=K1","v":false},{"$f":"OR(I2,K2)","v":false},{"$f":"OR($D$1=0,K2)","v":false}]
["Import!I1",null,null,null,null,"There is an exising index, last updated ",null,"(Find the last entry on or before the above date. All entries prior to this are new. Note If that is not page 1, append the new entries on subsequent pages.)"]
["Import!A2",null,null,null,null,"To create a new Index:",null,"Paste entries from subsequent pages below these to make one continuous list."]
[null,null,null,null,null,{"$f":"\"Go to step \" & IF(G2,2,4)","v":"Go to step 4"}]
["To create a new Index or update an existing one:"]
[]
[null,null,null,null,null,null,{"$f":"IF(L2,I1,IF(E2,F3,F4))","v":"There is an exising index, last updated "},{"$f":"IF(L2,F5,IF(E2,D1,\"\"))","v":"2025-11-07T15:49:39"}]
[]
[null,1,"Add topics created since the index was last updated."]
[]
[null,2,"Open the","Paper","forum on SOS and copy the rows containing new topic titles."]
[null,null,{"$f":"IF(M2,\"\",H3)","v":"(Find the last entry on or before the above date. All entries prior to this are new. Note If that is not page 1, append the new entries on subsequent pages.)"}]
[]
[null,3,"Paste these into cell A1 on the 'New Topics' sheet and return to this sheet."]
[null,null,{"$f":"IF(M2,H4,\"\")","v":""}]
[]
[null,4,"Click [Extract data] to copy the names and links from the' Import' sheet."]
[]
[null,5,"On sheet 3, enter any missing ship's names in column 'A' Omit 'HMS', 'USS' etc."]
{"$rows_left_out":10}
{"sheet":"Import","index":2,"n_rows":1151,"n_cols":9,"rows_kept":1151,"cut":false,"hidden":false,"merged":[]}
["Сестрорецк [Sestroretsk] Scratchbuild scale 1/64 Russ. torpedo boat 1894","https://shipsofscale.com/sosforums/threads/%D0%A1%D0%B5%D1%81%D1%82%D1%80%D0%BE%D1%80%D0%B5%D1%86%D0%BA-sestroretsk-scratchbuild-scale-1-64-russ-torpedo-boat-1894.15657/",null,null,null,null,null,null,"2025-11-07T15:49:39"]
["Iterum"]
["Nov 5, 2024"]
[2]
["Replies"]
[26]
["Views"]
[1798]
["Wednesday at 4:23 PM"]
["Iterum"]
["Hms Sussex - A dockyard model made of card","https://shipsofscale.com/sosforums/threads/hms-sussex-a-dockyard-model-made-of-card.17693/"]
["Ab Hoving"]
["Sep 8, 2025"]
["2 3"]
["Replies"]
[49]
["Views"]
[4889]
["Wednesday at 4:47 AM"]
["11320 Titanic"]
{"$rows_left_out":1132}
{"sheet":"Sheet2","index":3,"n_rows":134,"n_cols":6,"rows_kept":134,"cut":false,"hidden":false,"merged":[]}
["$B$12"]
[]
[]
[134]
[]
[]
[]
[]
[]
[]
["Ship","Title","Topic","Latest Post","Starter","Profile"]
["Sestroretsk","Сестрорецк [Sestroretsk] Scratchbuild scale 1/64 Russ. torpedo boat 1894","https://shipsofscale.com/sosforums/threads/%D0%A1%D0%B5%D1%81%D1%82%D1%80%D0%BE%D1%80%D0%B5%D1%86%D0%BA-sestroretsk-scratchbuild-scale-1-64-russ-torpedo-boat-1894.15657/","https://shipsofscale.com/sosforums/threads/%D0%A1%D0%B5%D1%81%D1%82%D1%80%D0%BE%D1%80%D0%B5%D1%86%D0%BA-sestroretsk-scratchbuild-scale-1-64-russ-torpedo-boat-1894.15657/page-2","Iterum",2]
[{"$error":"#N/A"},"Hms Sussex - A dockyard model made of card","https://shipsofscale.com/sosforums/threads/hms-sussex-a-dockyard-model-made-of-card.17693/","https://shipsofscale.com/sosforums/threads/hms-sussex-a-dockyard-model-made-of-card.17693/page-3","Ab Hoving",3]
["Queen Mary","RMS Queen Mary (Scale 1:1250)","https://shipsofscale.com/sosforums/threads/rms-queen-mary-scale-1-1250.7381/","https://shipsofscale.com/sosforums/threads/rms-queen-mary-scale-1-1250.7381/page-2","Jhoanor",2]
["Leudo","Seahorse LEUDO VINACCIERE 1/72","https://shipsofscale.com/sosforums/threads/seahorse-leudo-vinacciere-1-72.6765/","https://shipsofscale.com/sosforums/threads/rms-queen-mary-scale-1-1250.7381/page-2","Iterum"]
["Strohgbov","Steam tug STROHGBOV - 1:100 scale, own development.","https://shipsofscale.com/sosforums/threads/steam-tug-strohgbov-1-100-scale-own-development.15600/","https://shipsofscale.com/sosforums/threads/steam-tug-strohgbov-1-100-scale-own-development.15600/page-2","Lachezar Dragostinov",2]
[{"$error":"#N/A"},"New to Card Ships","https://shipsofscale.com/sosforums/threads/new-to-card-ships.17813/","https://shipsofscale.com/sosforums/threads/steam-tug-strohgbov-1-100-scale-own-development.15600/page-2","Tony1955"]
[{"$error":"#N/A"},"Russian torpedo boat KIT1899 or teaching modelbuilding","https://shipsofscale.com/sosforums/threads/russian-torpedo-boat-kit1899-or-teaching-modelbuilding.17355/","https://shipsofscale.com/sosforums/threads/russian-torpedo-boat-kit1899-or-teaching-modelbuilding.17355/page-2","Iterum",2]
["Magnus Mörck","Magnus Mörck","https://shipsofscale.com/sosforums/threads/magnus-m%C3%B6rck.13492/","https://shipsofscale.com/sosforums/threads/russian-torpedo-boat-kit1899-or-teaching-modelbuilding.17355/page-2","The learner"]
["Royal Yacht","An English Royal yacht","https://shipsofscale.com/sosforums/threads/an-english-royal-yacht.16993/","https://shipsofscale.com/sosforums/threads/russian-torpedo-boat-kit1899-or-teaching-modelbuilding.17355/page-2","Ab Hoving"]
{"$rows_left_out":115}
{"sheet":"Sheet3","index":4,"n_rows":139,"n_cols":7,"rows_kept":139,"cut":false,"hidden":false,"merged":[]}
[{"$f":"\"A\"&ROW(A16)+1","v":"A17"},3]
[{"$f":"CELL(\"Address\",G5)","v":"$G$5"}]
[{"$f":"ROW(B16)+1","v":17}]
[139]
[1,null,null,null,null,null,{"$f":"A5","v":1}]
[{"$f":"\"$A$\"&$A$3&\":$G$\"&$A$4","v":"$A$17:$G$139"}]
[{"$f":"\"$B$\"&$A$3&\":$G$\"&$A$4","v":"$B$17:$G$139"},{"$f":"\"=VLOOKUP(B12,Sheet3!\"&A7&\",6,False)\"","v":"=VLOOKUP(B12,Sheet3!$B$17:$G$139,6,False)"}]
[{"$f":"\"$B$\"&$A$3&\":$C$\"&$A$4","v":"$B$17:$C$139"}]
[1557]
[{"$f":"\"$A1\"&\":$A\"&A9","v":"$A1:$A1557"}]
[]
[]
[]
[]
["Subject:"]
[{"$f":"Index!A20","v":"Ship"},"Title","Topic","Latest","By","Page",{"$f":"A16","v":"Ship"}]
["Admiral Ushakow","ProModel ADMIRAL USHAKOW 1/200","https://shipsofscale.com/sosforums/threads/promodel-admiral-ushakow-1-200.15156/","https://shipsofscale.com/sosforums/threads/postiljon-a-dutch-frigate-1661-1678.15220/page-3","Iterum",null,{"$f":"A17","v":"Admiral Ushakow"}]
["Agassiz","HMV Flower Class HMCS Corvette Agassiz 1:250 scale [COMPLETED BUILD]","https://shipsofscale.com/sosforums/threads/hmv-flower-class-hmcs-corvette-agassiz-1-250-scale-completed-build.14495/","https://shipsofscale.com/sosforums/threads/hms-enterprize-1-96-card-model-from-shipyard.4495/page-3","johngr",null,"Agassiz"]
["Akerboom","AKERBOOM 1681 after Ab Hoving nominally 1/66 but drawings in 1/64","https://shipsofscale.com/sosforums/threads/akerboom-1681-after-ab-hoving-nominally-1-66-but-drawings-in-1-64.13749/","https://shipsofscale.com/sosforums/threads/akerboom-1681-after-ab-hoving-nominally-1-66-but-drawings-in-1-64.13749/page-12","Iterum",12,"Akerboom"]
["Albatross","ALBATROS","https://shipsofscale.com/sosforums/threads/albatros.15213/","https://shipsofscale.com/sosforums/threads/ship-in-trouble.13276/page-4","Llaut Mallorquin",null,"Albatross"]
{"$rows_left_out":120}
{"sheet":"Index","index":5,"n_rows":259,"n_cols":20,"rows_kept":259,"cut":false,"hidden":false,"merged":[]}
[{"$f":"\"A\" & ROW(A21)+1","v":"A22"},6,{"$f":"TEXT(NOW(),\"dd/mm/yy\")","v":"13/11/25"},"<head><meta charset=\"utf-8\" /></head>",null,null,"Edit these entries to change the formatting ---->","<td width=\"","<span style=\"text-decoration: underline;\">","<strong>","<em>","<tr>","<u>","<td>","<a href=\"","\">","<table width=\"","<tbody>","<p>","<div style=\"text-align: center;\">"]
[{"$f":"CELL(\"address\",A20)","v":"$A$20"},null,null,null,null,null,null,"%\">","</span>","</strong>","</em>","</tr>","</u>","</td>","</a>",null,"%\" border=\"0\">","</tbody>","&#160;","<div style=\"text-align: left;\">"]
[{"$f":"ROW(A21)+1","v":22},"Start Row",null,null,null,null,"See range stating at V1 for previous values",null,"<hr />","#TOP\">Back to Top","<a name=\"",null,null,null,null,null,"</table>",null,"</p>","</div>"]
[258,"End Row",null,null,null,null,{"$f":"$D$1& $B$8&$C$8","v":"<head><meta charset=\"utf-8\" /></head><div style=\"text-align: center;\"><strong>This is a list of all the build logs in the Paper forum - 13/11/25</strong></div><div style=\"text-align: center;\"></div><div style=\"text-align: center;\">The logs are in alphabetical order of the ships name (Ignoring any prefix, e.g. HMS, USS etc.)</div><div style=\"text-align: center;\">Select a letter from the list below to jump within the index.</div><hr /><div style=\"text-align: center;\"></div><div style=\"text-align: center;\"><a href=\"#A\">A</a>&#160;&#160;<a href=\"#B\">B</a>&#160;&#160;<a href=\"#C\">C</a>&#160;&#160;<a href=\"#D\">D</a>&#160;&#160;<a href=\"#E\">E</a>&#160;&#160;<a href=\"#F\">F</a>&#160;&#160;<a href=\"#G\">G</a>&#160;&#160;<a href=\"#H\">H</a>&#160;&#160;<a href=\"#I\">I</a>&#160;&#160;<a href=\"#J\">J</a>&#160;&#160;K&#160;&#160;<a href=\"#L\">L</a>&#160;&#160;<a href=\"#M\">M</a>&#160;&#160;<a href=\"#N\">N</a>&#160;&#160;<a href=\"#O\">O</a>&#160;&#160;<a href=\"#P\">P</a>&#160;&#160;<a href=\"#Q\">Q</a>&#160;&#160;<a href=\"#R\">R</a>&#160;&#160;<a href=\"#S\">S</a>&#160;&#160;<a href=\"#T\">T</a>&#160;&#160;<a href=\"#U\">U</a>&#160;&#160;<a href=\"#V\">V</a>&#160;&#160;<a href=\"#W\">W</a>&#160;&#160;X&#160;&#160;<a href=\"#Y\">Y</a>&#160;&#160;<a href=\"#Z\">Z</a>&#160;&#160;</div>"},"",null,null,null,null,null,null,null,null,null,null,{"$f":"S1&S2&S3","v":"<p>&#160;</p>"}]
[{"$f":"CELL(\"address\",$G$5)&\":\"&CELL(\"address\",$M$5)","v":"$G$5:$M$5"},{"$f":"B14&Start!D12& \" forum\"","v":"This is a list of all the build logs in the Paper forum"},null,null,null,null,{"$f":"H5&I5&J5&L5","v":"<tr><td><strong>$G$5:$M$5</strong></td><td></td><td><a href=\"\">This is a list of all the build logs in the Paper forum</a></td><td></td></tr>"},{"$f":"$L$1&$N$1&$J$1&A5&$J$2&$N$2","v":"<tr><td><strong>$G$5:$M$5</strong></td>"},{"$f":"$N$1&E5&$N$2","v":"<td></td>"},{"$f":"$N$1&$O$1&C5&$P$1&B5&$O$2&$N$2","v":"<td><a href=\"\">This is a list of all the build logs in the Paper forum</a></td>"},{"$f":"F5","v":0},{"$f":"$N$1&IF(K5>0,$O$1&D5&$P$1&\"Page \"&K5&$O$2,\"\")&$N$2&$L$2","v":"<td></td></tr>"},""]
[{"$f":"CELL(\"address\",G4)","v":"$G$4"},null,null,null,null,null,"heading 1","heading 2","heading 3","heading 4"]
[{"$f":"CELL(\"address\",G21)","v":"$G$21"},"Opening text","A-Z bar","Table setup",null,"Headings: ",{"$f":"$H$1&M16&$H$2&$I$1&$J$1&$A$20&$J$2&$I$2&$N$2","v":"<td width=\"20%\"><span style=\"text-decoration: underline;\"><strong>Ship</strong></span></td>"},{"$f":"$H$1&N16&$H$2&$I$1&$J$1&$E$20&$J$2&$I$2&$N$2","v":"<td width=\"12%\"><span style=\"text-decoration: underline;\"><strong>By</strong></span></td>"},{"$f":"$H$1&O16&$H$2&$I$1&$J$1&$B$20&$J$2&$I$2&$N$2","v":"<td width=\"62%\"><span style=\"text-decoration: underline;\"><strong>Topic</strong></span></td>"},{"$f":"$H$1&P16&$H$2&$I$1&$J$1&$D$20&$J$2&$I$2&$N$2","v":"<td width=\"6%\"><span style=\"text-decoration: underline;\"><strong>Latest</strong></span></td>"}]
[{"$f":"CELL(\"address\",G10)","v":"$G$10"},{"$f":"$T$1&$J$1&IF(B5<>\"\",B5&\" - \"&$C$1,\"\")&$J$2&$T$3     &$T$1&IF(C14<>\"\",C14,\"\")&$T$3    &$T$1&IF(D14<>\"\",D14,\"\")&$T$3   &$T$1&IF(E14<>\"\",E14,\"\")&$T$3 &$I$3& T1&T3","v":"<div style=\"text-align: center;\"><strong>This is a list of all the build logs in the Paper forum - 13/11/25</strong></div><div style=\"text-align: center;\"></div><div style=\"text-align: center;\">The logs are in alphabetical order of the ships name (Ignoring any prefix, e.g. HMS, USS etc.)</div><div style=\"text-align: center;\">Select a letter from the list below to jump within the index.</div><hr /><div style=\"text-align: center;\"></div>"},"<div style=\"text-align: center;\"><a href=\"#A\">A</a>&#160;&#160;<a href=\"#B\">B</a>&#160;&#160;<a href=\"#C\">C</a>&#160;&#160;<a href=\"#D\">D</a>&#160;&#160;<a href=\"#E\">E</a>&#160;&#160;<a href=\"#F\">F</a>&#160;&#160;<a href=\"#G\">G</a>&#160;&#160;<a href=\"#H\">H</a>&#160;&#160;<a href=\"#I\">I</a>&#160;&#160;<a href=\"#J\">J</a>&#160;&#160;K&#160;&#160;<a href=\"#L\">L</a>&#160;&#160;<a href=\"#M\">M</a>&#160;&#160;<a href=\"#N\">N</a>&#160;&#160;<a href=\"#O\">O</a>&#160;&#160;<a href=\"#P\">P</a>&#160;&#160;<a href=\"#Q\">Q</a>&#160;&#160;<a href=\"#R\">R</a>&#160;&#160;<a href=\"#S\">S</a>&#160;&#160;<a href=\"#T\">T</a>&#160;&#160;<a href=\"#U\">U</a>&#160;&#160;<a href=\"#V\">V</a>&#160;&#160;<a href=\"#W\">W</a>&#160;&#160;X&#160;&#160;<a href=\"#Y\">Y</a>&#160;&#160;<a href=\"#Z\">Z</a>&#160;&#160;</div>",{"$f":"$L$10&$R$1&$L$1&$G$7&$H$7&$I$7&$J$7&$M$2&$L$2","v":"<table width=\"100%\" border=\"0\"><tbody><tr><td width=\"20%\"><span style=\"text-decoration: underline;\"><strong>Ship</strong></span></td><td width=\"12%\"><span style=\"text-decoration: underline;\"><strong>By</strong></span></td><td width=\"62%\"><span style=\"text-decoration: underline;\"><strong>Topic</strong></span></td><td width=\"6%\"><span style=\"text-decoration: underline;\"><strong>Latest</strong></span></td></u></tr>"},"First row",null,{"$f":"IF(INDIRECT($A$1)<>\" \",$L$1&$N$1&\"&#160;\"&$N$2&$L$2,\"\")","v":""}]
[null,null,null,null,null,"Divide table: ",{"$f":"$I$3&$S$1&O$1&$J$3&$O$2&$S$3","v":"<hr /><p><a href=\"#TOP\">Back to Top</a></p>"},{"$f":"$T$2&$I$3&$K$3","v":"<div style=\"text-align: left;\"><hr /><a name=\""},{"$f":"$P$1&$O$2&$J$1","v":"\"></a><strong>"},{"$f":"$J$2&$M$2&$S$3&T3","v":"</strong></u></p></div>"},null,"<p><u><a name=\"A\"></a><strong>A</strong></u></p><table width=\"100%\" border=\"0\"><tbody><tr><td width=\"40%\"><span style=\"text-decoration: underline;\"><strong>Subject</strong></span></td><td width=\"40%\"><span style=\"text-decoration: underline;\"><strong>Document</strong></span></td><td width=\"20%\"><span style=\"text-decoration: underline;\"><strong>Page</strong></span></td></u></tr>",""]
[{"$f":"A20","v":"Ship"},{"$f":"G9&IF(B18<>\"\",$I$3&$S$1&B18&$S$3&$S$1&IF(C18<>\"\",C18,$S$2)&$S$3&IF(D18<>\"\",$S$1&D18&$S$3,IF(E18<>\"\",$S$4,IF(C18<>\"\",$S$4,\"\")))&IF(E18<>\"\",$S$1&E18&$S$3&$S$4,IF(D18<>\"\",$S$4,\"\")),\"\")","v":"<hr /><p><a href=\"#TOP\">Back to Top</a></p><hr /><p>If you have any comments or require any corrections or amendments to this index, please post them <a href=\"https://shipsofscale.com/sosforums/threads/sos-card-stock-paper-index.13063/\">here</a></p><p>&#160;</p>"},"",null,null,null,{"$f":"$R$2&$Q$3&IF($B$10<>\"\",$S$4&$B$10,\"\")","v":"</tbody></table><p>&#160;</p><hr /><p><a href=\"#TOP\">Back to Top</a></p><hr /><p>If you have any comments or require any corrections or amendments to this index, please post them <a href=\"https://shipsofscale.com/sosforums/threads/sos-card-stock-paper-index.13063/\">here</a></p><p>&#160;</p>"},"",null,null,null,{"$f":"Q1&M13&Q2","v":"<table width=\"100%\" border=\"0\">"}]
[]
[null,"Opening Text"]
[null,"Line 1","Line 2","Line 3","Line 4",null,"Edit this entry to change the overall table width",null,null,null,null,null,100]
[null,"This is a list of all the build logs in the ",null,"The logs are in alphabetical order of the ships name (Ignoring any prefix, e.g. HMS, USS etc.)","Select a letter from the list below to jump within the index."]
[null,null,null,null,null,null,null,null,null,null,null,null,"Col. 1","Col. 2","Col. 3","Col. 4"]
[null,"Closing Text",null,null,null,null,"Edit these entries to change the column widths",null,null,null,null,null,20,12,62,{"$f":"MAX(100-SUM(M16:O16),0)","v":6}]
[null,"Line 1","Line 2","Line 3","Line 4"]
[null,"If you have any comments or require any corrections or amendments to this index, please post them <a href=\"https://shipsofscale.com/sosforums/threads/sos-card-stock-paper-index.13063/\">here</a>"]
[null,null,null,null,null,null,null,null,null,"topic +"]
["Ship","Topic","Topic Link","Latest","By","Page","HTML Index Text","ship","by","link","Page","Page + link"]
{"$rows_left_out":239}